{"text_format":"1","workbook":"xlsx","n_sheets":7,"sheets":["Anleitung","Örtliche Zuordnung","OPTA Generator","OPTA Tabelle","Werte","Formeln","Version"],"not_rendered":{"charts":0,"images":2,"macros":1,"external_links":0,"defined_names":33,"comments":1,"pivot_tables":0},"unopened":[],"bounds":{"document_bytes":16777216,"sheet_cells":100000,"rows_first":2000,"rows_last":500,"rows_between":2000,"halvings":0,"cell_chars":16384,"cell_head_chars":4096},"cells_cut":0,"cells_raw":0,"read":"whole","date_system":"1900"}

{"sheet":"Anleitung","index":0,"n_rows":2,"n_cols":1,"rows_kept":2,"cut":false,"hidden":false,"merged":[[1,0,1,11]]}
[]
["Tabellenblatt: Örtliche Zuordnung"]

{"sheet":"Örtliche Zuordnung","index":1,"n_rows":166,"n_cols":192,"rows_kept":166,"cut":false,"hidden":false,"merged":[]}
["A#",{"$f":"IF(ISBLANK(A1),\"\",\"Abk_\"&A1)","v":"Abk_A#"},"AIC",{"$f":"IF(ISBLANK(C1),\"\",\"Abk_\"&C1)","v":"Abk_AIC"},"DLG",{"$f":"IF(ISBLANK(E1),\"\",\"Abk_\"&E1)","v":"Abk_DLG"},"DON",{"$f":"IF(ISBLANK(G1),\"\",\"Abk_\"&G1)","v":"Abk_DON"},null,{"$f":"IF(ISBLANK(I1),\"\",\"Abk_\"&I1)","v":""},null,{"$f":"IF(ISBLANK(K1),\"\",\"Abk_\"&K1)","v":""},null,{"$f":"IF(ISBLANK(M1),\"\",\"Abk_\"&M1)","v":""},null,{"$f":"IF(ISBLANK(O1),\"\",\"Abk_\"&O1)","v":""},null,{"$f":"IF(ISBLANK(Q1),\"\",\"Abk_\"&Q1)","v":""},null,{"$f":"IF(ISBLANK(S1),\"\",\"Abk_\"&S1)","v":""},null,{"$f":"IF(ISBLANK(U1),\"\",\"Abk_\"&U1)","v":""},null,{"$f":"IF(ISBLANK(W1),\"\",\"Abk_\"&W1)","v":""},null,{"$f":"IF(ISBLANK(Y1),\"\",\"Abk_\"&Y1)","v":""},null,{"$f":"IF(ISBLANK(AA1),\"\",\"Abk_\"&AA1)","v":""},null,{"$f":"IF(ISBLANK(AC1),\"\",\"Abk_\"&AC1)","v":""},null,{"$f":"IF(ISBLANK(AE1),\"\",\"Abk_\"&AE1)","v":""},null,{"$f":"IF(ISBLANK(AG1),\"\",\"Abk_\"&AG1)","v":""},null,{"$f":"IF(ISBLANK(AI1),\"\",\"Abk_\"&AI1)","v":""},null,{"$f":"IF(ISBLANK(AK1),\"\",\"Abk_\"&AK1)","v":""},null,{"$f":"IF(ISBLANK(AM1),\"\",\"Abk_\"&AM1)","v":""},null,{"$f":"IF(ISBLANK(AO1),\"\",\"Abk_\"&AO1)","v":""},null,{"$f":"IF(ISBLANK(AQ1),\"\",\"Abk_\"&AQ1)","v":""},null,{"$f":"IF(ISBLANK(AS1),\"\",\"Abk_\"&AS1)","v":""},null,{"$f":"IF(ISBLANK(AU1),\"\",\"Abk_\"&AU1)","v":""},null,{"$f":"IF(ISBLANK(AW1),\"\",\"Abk_\"&AW1)","v":""},null,{"$f":"IF(ISBLANK(AY1),\"\",\"Abk_\"&AY1)","v":""},null,{"$f":"IF(ISBLANK(BA1),\"\",\"Abk_\"&BA1)","v":""},null,{"$f":"IF(ISBLANK(BC1),\"\",\"Abk_\"&BC1)","v":""},null,{"$f":"IF(ISBLANK(BE1),\"\",\"Abk_\"&BE1)","v":""},null,{"$f":"IF(ISBLANK(BG1),\"\",\"Abk_\"&BG1)","v":""},null,{"$f":"IF(ISBLANK(BI1),\"\",\"Abk_\"&BI1)","v":""},null,{"$f":"IF(ISBLANK(BK1),\"\",\"Abk_\"&BK1)","v":""},null,{"$f":"IF(ISBLANK(BM1),\"\",\"Abk_\"&BM1)","v":""},null,{"$f":"IF(ISBLANK(BO1),\"\",\"Abk_\"&BO1)","v":""},null,{"$f":"IF(ISBLANK(BQ1),\"\",\"Abk_\"&BQ1)","v":""},null,{"$f":"IF(ISBLANK(BS1),\"\",\"Abk_\"&BS1)","v":""},null,{"$f":"IF(ISBLANK(BU1),\"\",\"Abk_\"&BU1)","v":""},null,{"$f":"IF(ISBLANK(BW1),\"\",\"Abk_\"&BW1)","v":""},null,{"$f":"IF(ISBLANK(BY1),\"\",\"Abk_\"&BY1)","v":""},null,{"$f":"IF(ISBLANK(CA1),\"\",\"Abk_\"&CA1)","v":""},null,{"$f":"IF(ISBLANK(CC1),\"\",\"Abk_\"&CC1)","v":""},null,{"$f":"IF(ISBLANK(CE1),\"\",\"Abk_\"&CE1)","v":""},null,{"$f":"IF(ISBLANK(CG1),\"\",\"Abk_\"&CG1)","v":""},null,{"$f":"IF(ISBLANK(CI1),\"\",\"Abk_\"&CI1)","v":""},null,{"$f":"IF(ISBLANK(CK1),\"\",\"Abk_\"&CK1)","v":""},null,{"$f":"IF(ISBLANK(CM1),\"\",\"Abk_\"&CM1)","v":""},null,{"$f":"IF(ISBLANK(CO1),\"\",\"Abk_\"&CO1)","v":""},null,{"$f":"IF(ISBLANK(CQ1),\"\",\"Abk_\"&CQ1)","v":""},null,{"$f":"IF(ISBLANK(CS1),\"\",\"Abk_\"&CS1)","v":""},null,{"$f":"IF(ISBLANK(CU1),\"\",\"Abk_\"&CU1)","v":""},null,{"$f":"IF(ISBLANK(CW1),\"\",\"Abk_\"&CW1)","v":""},null,{"$f":"IF(ISBLANK(CY1),\"\",\"Abk_\"&CY1)","v":""},null,{"$f":"IF(ISBLANK(DA1),\"\",\"Abk_\"&DA1)","v":""},null,{"$f":"IF(ISBLANK(DC1),\"\",\"Abk_\"&DC1)","v":""},null,{"$f":"IF(ISBLANK(DE1),\"\",\"Abk_\"&DE1)","v":""},null,{"$f":"IF(ISBLANK(DG1),\"\",\"Abk_\"&DG1)","v":""},null,{"$f":"IF(ISBLANK(DI1),\"\",\"Abk_\"&DI1)","v":""},null,{"$f":"IF(ISBLANK(DK1),\"\",\"Abk_\"&DK1)","v":""},null,{"$f":"IF(ISBLANK(DM1),\"\",\"Abk_\"&DM1)","v":""},null,{"$f":"IF(ISBLANK(DO1),\"\",\"Abk_\"&DO1)","v":""},null,{"$f":"IF(ISBLANK(DQ1),\"\",\"Abk_\"&DQ1)","v":""},null,{"$f":"IF(ISBLANK(DS1),\"\",\"Abk_\"&DS1)","v":""},null,{"$f":"IF(ISBLANK(DU1),\"\",\"Abk_\"&DU1)","v":""},null,{"$f":"IF(ISBLANK(DW1),\"\",\"Abk_\"&DW1)","v":""},null,{"$f":"IF(ISBLANK(DY1),\"\",\"Abk_\"&DY1)","v":""},null,{"$f":"IF(ISBLANK(EA1),\"\",\"Abk_\"&EA1)","v":""},null,{"$f":"IF(ISBLANK(EC1),\"\",\"Abk_\"&EC1)","v":""},null,{"$f":"IF(ISBLANK(EE1),\"\",\"Abk_\"&EE1)","v":""},null,{"$f":"IF(ISBLANK(EG1),\"\",\"Abk_\"&EG1)","v":""},null,{"$f":"IF(ISBLANK(EI1),\"\",\"Abk_\"&EI1)","v":""},null,{"$f":"IF(ISBLANK(EK1),\"\",\"Abk_\"&EK1)","v":""},null,{"$f":"IF(ISBLANK(EM1),\"\",\"Abk_\"&EM1)","v":""},null,{"$f":"IF(ISBLANK(EO1),\"\",\"Abk_\"&EO1)","v":""},null,{"$f":"IF(ISBLANK(EQ1),\"\",\"Abk_\"&EQ1)","v":""},null,{"$f":"IF(ISBLANK(ES1),\"\",\"Abk_\"&ES1)","v":""},null,{"$f":"IF(ISBLANK(EU1),\"\",\"Abk_\"&EU1)","v":""},null,{"$f":"IF(ISBLANK(EW1),\"\",\"Abk_\"&EW1)","v":""},null,{"$f":"IF(ISBLANK(EY1),\"\",\"Abk_\"&EY1)","v":""},null,{"$f":"IF(ISBLANK(FA1),\"\",\"Abk_\"&FA1)","v":""},null,{"$f":"IF(ISBLANK(FC1),\"\",\"Abk_\"&FC1)","v":""},null,{"$f":"IF(ISBLANK(FE1),\"\",\"Abk_\"&FE1)","v":""},null,{"$f":"IF(ISBLANK(FG1),\"\",\"Abk_\"&FG1)","v":""},null,{"$f":"IF(ISBLANK(FI1),\"\",\"Abk_\"&FI1)","v":""},null,{"$f":"IF(ISBLANK(FK1),\"\",\"Abk_\"&FK1)","v":""},null,{"$f":"IF(ISBLANK(FM1),\"\",\"Abk_\"&FM1)","v":""},null,{"$f":"IF(ISBLANK(FO1),\"\",\"Abk_\"&FO1)","v":""},null,{"$f":"IF(ISBLANK(FQ1),\"\",\"Abk_\"&FQ1)","v":""},null,{"$f":"IF(ISBLANK(FS1),\"\",\"Abk_\"&FS1)","v":""},null,{"$f":"IF(ISBLANK(FU1),\"\",\"Abk_\"&FU1)","v":""},null,{"$f":"IF(ISBLANK(FW1),\"\",\"Abk_\"&FW1)","v":""},null,{"$f":"IF(ISBLANK(FY1),\"\",\"Abk_\"&FY1)","v":""},null,{"$f":"IF(ISBLANK(GA1),\"\",\"Abk_\"&GA1)","v":""},null,{"$f":"IF(ISBLANK(GC1),\"\",\"Abk_\"&GC1)","v":""},null,{"$f":"IF(ISBLANK(GE1),\"\",\"Abk_\"&GE1)","v":""},null,{"$f":"IF(ISBLANK(GG1),\"\",\"Abk_\"&GG1)","v":""},null,{"$f":"IF(ISBLANK(GI1),\"\",\"Abk_\"&GI1)","v":""}]
["Achsheim","ACHHM","Adelzhausen","ADHSN","Aislingen","AINGN","Alerheim","ALRHM"]
["Adelsried","ADSRD","Affing","AFFNG","Altenbaindt","ALTBT","Altisheim","ALTHM"]
["Affaltern","AFTRN","Aichach","AICHA","Asbach","ASBCH","Amerbach","AMMBH"]
["Agawang","AGAWG","Aindling","AINLG","Bachhagel","BHHG1","Amerdingen","AMNGN"]
["Allmannshofen","ALMHF","Allenberg","ALLBG","Bachhagel-Burghagel","BHHG3","Appetshofen - Lierheim","APLHM"]
["Altenmünster","ALMST","Alsmoos","ALSMS","Bachhagel-Oberbechingen","BHHG2","Asbach-Bäumenheim","ASBHM"]
["Anhausen","ANHSN","Anwalting","ANWIG","Bächingen","BANGN","Asbach-Bäumenheim Agco Fendt","AFNDT"]
["Anried","ANRD_","Aulzhausen","ALHSN","Baumgarten","BAUMG","Auchsesheim","AUCHM"]
["Aretsried","ARERD","Baar","BAAR_","Bergheim","BRGHM","Aufhausen","AFHSN"]
["Auerbach","AURBC","Bachern","BCHRN","Binswangen","BINWG","Auhausen","AUHSN"]
["Aystetten","AYSTE","Baindlkirch","BDLKH","Bissingen","BSNGN","Baierfeld","BAIFD"]
["Baiershofen","BAIHN","Burgadelzhausen","BADHN","Bliensbach","BLIBH","Baldingen","BANGN"]
["Batzenhofen","BAZHN","Dasing","DASNG","Blindheim","BLDHM","Balgheim","BALHM"]
["Biberbach","BIBBC","Derching","DCHIG","Bocksberg","BOKBG","Bayerdilling","BAYNG"]
["Biburg","BIBR_","Ebenried","EBNRD","Burgmagerbein","BRGMB","Belzheim-Ehingen a. Ries","BELHM"]
["Bieselbach","BISBC","Echsheim","EHSHM","Buttenwiesen","BTWSN","Berg","BERG"]
["Birkach","BIRKA","Ecknach","ECKNH","Deisenhofen","DSHFN","Bergendorf","BERDF"]
["Blankenburg","BLABG","Edenried","EDNRD","Diemantstein","DIEST","Bergstetten","BERTN"]
["Bobingen","BOBGN","Eismannsberg","EISBG","Dillingen","DILLG","Birkhausen","BIHSN"]
{"$rows_left_out":147}
{"sheet":"OPTA Generator","index":2,"n_rows":34,"n_cols":29,"rows_kept":34,"cut":false,"hidden":false,"merged":[[1,25,5,25],[9,1,9,7],[14,8,14,24],[14,1,14,7],[11,1,11,7],[7,8,7,24],[9,8,9,24],[11,8,11,24],[8,1,8,7],[8,8,8,24],[10,1,10,7],[10,8,10,24],[13,1,13,7],[13,8,13,24],[12,1,12,7],[12,8,12,24],[4,1,4,7],[4,8,4,24],[6,1,6,7],[6,8,6,24],[7,1,7,7],[17,8,17,24],[30,1,30,20],[29,1,29,20],[15,8,15,24],[15,1,15,7],[16,1,16,7],[16,8,16,24],[17,1,17,7],[20,1,20,24],[22,8,24,8],[22,21,24,21],[22,20,24,20],[22,2,24,2],[22,1,24,1],[22,13,24,13],[22,12,24,12],[22,3,24,3],[25,6,26,8],[25,3,26,5],[22,11,24,11],[22,10,24,10],[22,9,24,9],[22,7,24,7],[22,6,24,6],[22,24,24,24],[22,23,24,23],[22,22,24,22],[22,5,24,5],[22,4,24,4],[21,25,25,25],[32,1,32,20],[33,1,33,20],[2,4,2,5],[2,1,2,2],[25,1,26,2],[22,14,24,14],[25,24,26,24],[25,22,26,23],[25,14,26,21],[25,9,26,13],[22,19,24,19],[22,18,24,18],[22,17,24,17],[22,16,24,16],[22,15,24,15]]}
[]
[null,"OPTA Generator für npol BOS",null,null,null,null,null,null,null,null,null,null,null,null,null,null,null,null,null,null,null,null,null,null,null,"Spalte ausblenden"]
[null,"Version 0.8",null,null,"2015-04-21"]
[]
[null,"Anmerkung:",null,null,null,null,null,null,"Eingabefelder (hellgrün) sind Auswahllisten"]
[]
[null,null,null,null,null,null,null,null,"Bayern",null,null,null,null,null,null,null,null,null,null,null,null,null,null,null,null,"","BY","Fester Wert","01-02"]
[null,{"$f":"IF(ISBLANK(I8),\"Auswahlt fehlt\",\"\")","v":""},null,null,null,null,null,null,"Feuerwehr",null,null,null,null,null,null,null,null,null,null,null,null,null,null,null,null,{"$f":"LOOKUP(I8,Organisation,Werte!B2:B13)","v":"FW "},{"$f":"Z8&REPT(\" \",3-LEN(Z8))","v":"FW "},"Organisation, 3 stellig","03-05"]
[null,{"$f":"IF(ISBLANK(I9),\"Auswahlt fehlt\",\"\")","v":""},null,null,null,null,null,null,"Schwaben",null,null,null,null,null,null,null,null,null,null,null,null,null,null,null,null,null,null,"Vorauswahl für das Feld Landkreis"]
[null,{"$f":"IF(ISBLANK(I10),\"Auswahlt fehlt\",\nIF(OR(ISBLANK(I11),ISBLANK(I12)),\"\",\nIF(AND($Z$11=\"Oez\",NOT(ISERROR(MATCH($I$10,Bezirk,0)))),\"Regierungsbezirk nicht möglich\",\nIF(AND($Z$11=\"UeE\",ISERROR(MATCH($I$10,Bezirk,0)),$I$10<>$I$12),\"Zeilen 10 und 12 unterschiedlich\",\"\"))))","v":""},null,null,null,null,null,null,"Dillingen a.d.Donau, Landkreis",null,null,null,null,null,null,null,null,null,null,null,null,null,null,null,null,{"$f":"HLOOKUP(\"WERT_Landkreis\",Werte!E:F,MATCH(I10,Werte!E:E,0),FALSE)","v":"DLG"},{"$f":"Z10&REPT(\" \",3-LEN(Z10))","v":"DLG"},"Landkreis, 3 stellig","06-08"]
[null,{"$f":"IF(ISBLANK(I11),\"Auswahlt fehlt\",\nIF(AND(NOT(ISERROR(MATCH($I$10,Bezirk,0))),Z11=\"Oez\"),\"Reg. Zuordnung nicht möglich\",\"\"))","v":""},null,null,null,null,null,null,"Örtliche Zuordnung",null,null,null,null,null,null,null,null,null,null,null,null,null,null,null,null,{"$f":"HLOOKUP(\"WERT_Auswahl_I12\",Werte!G:H,MATCH(I11,Werte!G:G,0),FALSE)","v":"OeZ"},null,"Örtliche Zuordnung oder Überörtliche Einheiten"]
[null,{"$f":"IF(Z11=\"UeE\",\"\",IF(ISBLANK(I11),\"\",IF(ISERROR(MATCH(Z10,'Örtliche Zuordnung'!1:1,0)),\"Örtl. Zuordnung KfSt./Lkr. fehlt\",IF(ISBLANK(I12),\"Auswahlt fehlt\",\"\"))))","v":""},null,null,null,null,null,null,"Unterthürheim",null,null,null,null,null,null,null,null,null,null,null,null,null,null,null,null,{"$f":"IF(AND($Z$11=\"Oez\",ISERROR(MATCH($I$10,Bezirk,0))),HLOOKUP(\"Abk_\"&$Z$10,Reg_Ortsnamen,MATCH($I$12,OFFSET('Örtliche Zuordnung'!A:A,,MATCH($Z$10,'Örtliche Zuordnung'!$1:$1,0)-1),0),FALSE),IF(AND($Z$11=\"UeE\",ISERROR(MATCH($I$10,Bezirk,0)),$I$10<>$I$12),NA(),HLOOKUP(\"WERT_Landkreis\",Werte!E:F,MATCH($I$12,Werte!E:E,0),FALSE)))","v":"THHM1"},{"$f":"IF($Z$11=\"Oez\",Z12&REPT(\" \",5-LEN(Z12)),Z12&REPT(\" \",3-LEN(Z12)))","v":"THHM1"},{"$f":"IF(ISBLANK(I11),\"\",I11)","v":"Örtliche Zuordnung"},{"$f":"IF($Z$11=\"Oez\",\"09-13\",\"09-11\")","v":"09-13"}]
[null,{"$f":"IF(ISBLANK(I11),\"\",IF(AND($Z$11=\"UeE\",ISBLANK(I13)),\"Auswahlt fehlt\",\"\"))","v":""},null,null,null,null,null,null,null,null,null,null,null,null,null,null,null,null,null,null,null,null,null,null,null,{"$f":"IF(AND($Z$11=\"Oez\",ISERROR(MATCH($I$10,Bezirk,0))),\"\",IF(AND($Z$11=\"UeE\",ISERROR(MATCH($I$10,Bezirk,0)),$I$10<>$I$12),NA(),HLOOKUP(\"WERT_Fachdienst\",Werte!I:J,MATCH($I$13,Werte!I:I,0),FALSE)))","v":""},{"$f":"Z13&REPT(\" \",1-LEN(Z13))","v":" "},{"$f":"IF($Z$11=\"UeE\",\"Fachdienstzuweisung\",\"\")","v":""},{"$f":"IF($Z$11=\"UeE\",\"12\",\"\")","v":""}]
[null,{"$f":"IF(ISBLANK(I11),\"\",IF(AND($Z$11=\"UeE\",ISBLANK(I14)),\"Auswahlt fehlt\",\"\"))","v":""},null,null,null,null,null,null,null,null,null,null,null,null,null,null,null,null,null,null,null,null,null,null,null,{"$f":"IF(AND($Z$11=\"Oez\",ISERROR(MATCH($I$10,Bezirk,0))),\"\",IF(AND($Z$11=\"UeE\",ISERROR(MATCH($I$10,Bezirk,0)),$I$10<>$I$12),NA(),HLOOKUP(\"WERT_Lfd_Nummer\",Werte!K:L,MATCH($I$14,Werte!K:K,0),FALSE)))","v":""},{"$f":"Z14&REPT(\" \",1-LEN(Z14))","v":" "},{"$f":"IF($Z$11=\"UeE\",\"Lfd. Nummer\",\"\")","v":""},{"$f":"IF($Z$11=\"UeE\",\"13\",\"\")","v":""}]
[null,{"$f":"IF(ISBLANK(I15),\"Auswahlt fehlt\",\"\")","v":""},null,null,null,null,null,null,"10 – Führungs- u. Mannschaftstransportfahrzeuge",null,null,null,null,null,null,null,null,null,null,null,null,null,null,null,null,{"$f":"HLOOKUP(\"Funknamen Vorauswahl\",Werte!M:N,MATCH(I15,Werte!M:M,0),FALSE)","v":"Ausw10"},null,"Vorauswahl für das Feld Funktionsbezeichnung"]
[null,{"$f":"IF(ISBLANK(I16),\"Auswahlt fehlt\",\"\")","v":""},null,null,null,null,null,null,"Mehrzweckfahrzeug",null,null,null,null,null,null,null,null,null,null,null,null,null,null,null,null,{"$f":"HLOOKUP(\"WERT_OPTA\",Werte!R:S,MATCH(I16,Werte!R:R,0),FALSE)","v":"MZF   11"},{"$f":"Z16&REPT(\" \",8-LEN(Z16))","v":"MZF   11"},"Normbezeichnung","14-21"]
[null,{"$f":"IF(ISBLANK(I17),\"Auswahlt fehlt\",\"\")","v":""},null,null,null,null,null,null,"1",null,null,null,null,null,null,null,null,null,null,null,null,null,null,null,null,{"$f":"HLOOKUP(\"WERT_Lfd_Nummer\",Werte!K:L,MATCH(I17,Werte!K:K,0),FALSE)","v":"1"},{"$f":"REPT(\" \",2-LEN(Z17))&Z17","v":" 1"},"Laufende Nummer","22-23"]
[null,{"$f":"IF(ISBLANK(I18),\"Auswahlt fehlt\",\"\")","v":""},null,null,null,null,null,null,"1. fest verbautes Funkgerät",null,null,null,null,null,null,null,null,null,null,null,null,null,null,null,null,{"$f":"HLOOKUP(\"WERT_Funkgeraet\",Werte!Y:Z,MATCH(I18,Werte!Y:Y,0),FALSE)","v":""},{"$f":"Z18&REPT(\" \",1-LEN(Z18))","v":" "},"Ggf. Kennziffer 1 stellig (1-9, A-Z), z.B. Funkgerät","24"]
[]
[]
{"$rows_left_out":15}
{"sheet":"OPTA Tabelle","index":3,"n_rows":1001,"n_cols":3,"rows_kept":1001,"cut":false,"hidden":false,"merged":[]}
["Nr.","OPTA Tabelle","ELDIS Ausleitung"]
[{"$f":"ROW()-1","v":1},"BYFW DONALTHMMZF   11 1 ","ALTHMMZF   11 1 "]
[{"$f":"ROW()-1","v":2}]
[3]
[4]
[5]
[6]
[7]
[8]
[9]
[10]
[11]
[12]
[13]
[14]
[15]
[16]
[17]
[18]
[19]
{"$rows_left_out":982}
{"sheet":"Werte","index":4,"n_rows":265,"n_cols":31,"rows_kept":265,"cut":false,"hidden":true,"merged":[[21,0,25,3]]}
["Organisation","Wert_Organisation","Bezirk Vorauswahl","WERT_Bezirk","Landkreis","WERT_Landkreis","Auswahlfeld Zuordnung","WERT_Auswahl_I12","Fachdienst","WERT_Fachdienst","Lfd_Nummer","WERT_Lfd_Nummer","Funktionsbezeichnung Vorauswahl","Funknamen Vorauswahl","Lfd_ANummer","WERT_Lfd_ANummer",null,"Funktionsbezeichnung","WERT_OPTA","Länge","Anz. Leerzeichen","Pos. Erstes Leerzeichen","Ordnungskennung","WERT_Ordnungskennung","Funkgeraet","WERT_Funkgeraet",null,"aus Org. OPTA-Liste",null,"Landkreis","Kfz-Kennz"]
["Arbeiter-Samariter-Bund","ASB","Mittelfranken","MFR","Bayern","BY","Örtliche Zuordnung","OeZ","Ohne Zuweisung"," ","Ohne Zuweisung"," ","00 – Einrichtungen und Funktionen","Ausw00","Ohne Zuweisung"," ","00","Einsatzleiter Bergrettung","ELBR   7",{"$f":"LEN(S2)","v":8},{"$f":"IF(LEN(S2)-LEN(SUBSTITUTE(LOWER(S2),\" \",))=0,\"\",LEN(S2)-LEN(SUBSTITUTE(LOWER(S2),\" \",)))","v":3},{"$f":"IF(ISERR(SEARCH(\" \",S2)),\"\",SEARCH(\" \",S2))","v":5},"0","0","Handsprechfunkgerät ohne Fahrzeugzuordnung","",null,"MOBWAC 0",null,"Augsburg, Kreisfreie Stadt","A"]
["Bergwacht Bayern","BGW","Niederbayern","NBY","Mittelfranken","MFR","Überörtliche Einheiten","UeE","Führung","1","1","1","10 – Führungs- u. Mannschaftstransportfahrzeuge","Ausw10","1","1","00","Einsatzleiter Rettungsdienst","ELRD   7",8,3,5,"1","1","1. Handsprechfunkgerät des Fahrzeuges","1",null,"       0",null,"Augsburg, Landkreis","A#"]
["Deutsche Lebensrettungs-Gesellschaft","DLR","Oberbayern","OBY","Ansbach, Kreisfreie Stadt","AN",null,null,"Information und Kommunikation (IuK)","2","2","2","20 – Tanklöschfahrzeuge","Ausw20","2","2","00","Einsatzleiter Wasserrettung","ELWR   7",8,3,5,"2","2","2. Handsprechfunkgerät des Fahrzeuges","2",null,"LTR    1",null,"Aschaffenburg, Kreisfreie Stadt","AB"]
["Deutsches Rotes Kreuz","DRK","Oberfranken","OFR","Ansbach, Landkreis","AN#",null,null,"Technik und Sicherheit","3","3","3","30 – Hubrettungs-, Wechsellader-, u. Kranfahrzeuge","Ausw30","3","3","00","Feuerwehreinsatzzentrale München","FEZ-M# 0",8,1,7,"3","3","3. Handsprechfunkgerät des Fahrzeuges","3",null,"LTRSTV 2",null,"Aschaffenburg, Landkreis","AB#"]
["Feuerwehr","FW ","Oberpfalz","OPF","Erlangen, Kreisfreie Stadt","ER",null,null,"Sanitätsdienst","4","4","4","40 – Lösch- und Tragkraftspritzenfahrzeuge","Ausw40","4","4","00","Feuerwehrhaus","FWH    0",8,4,4,"4","4","4. Handsprechfunkgerät des Fahrzeuges","4",null,"       3",null,"Aichach-Friedberg, Landkreis","AIC"]
["Integrierte Leitstellen","ILS","Schwaben","SBN","Erlangen-Höchstadt, Landkreis","ERH",null,null,"Suchen & Ortung","5","5","5","50 – Gerätewagen, Schlauchwagen","Ausw50","5","5","00","Funkstelle FüGK","FÜGK   0",8,3,5,"5","5","5. Handsprechfunkgerät des Fahrzeuges","5",null,"       4",null,"Amberg, Kreisfreie Stadt","AM"]
["Johanniter Unfallhilfe","JUH","Unterfranken","UFR","Fürth, Kreisfreie Stadt","FÜ",null,null,"Betreuung","6","6","6","60 – Rüst- und Gerätewagen","Ausw60","6","6","00","Funkzentrale","ZENTR  0",8,2,6,"6","6","6. Handsprechfunkgerät des Fahrzeuges","6",null,"ELTR   7",null,"Ansbach, Kreisfreie Stadt","AN"]
["Katastrophenschutzeinheiten","KAT",null,null,"Fürth, Landkreis","FÜ#",null,null,"Rettung","7","7","7","70 – Landrettungsdienst","Ausw70","7","7","00","Integrierte Leitstelle","ILS    0",8,4,4,"7","7","7. Handsprechfunkgerät des Fahrzeuges","7",null,"KONFÜ  7",null,"Ansbach, Landkreis","AN#"]
["Malteser Hilfsdienst","MHD",null,null,"Neustadt a.d.Aisch-Bad Windsheim, Landkreis","NEA",null,null,"Bergrettung","8","8","8","80 – Berg- und Höhlenrettung","Ausw80","8","8","00","Kommandant","KDT    1",8,4,4,"8","8","8. Handsprechfunkgerät des Fahrzeuges","8",null,"       8",null,"Altötting, Landkreis","AÖ"]
["Rettungshubschrauber","CHR",null,null,"Nürnberg, Kreisfreie Stadt","N",null,null,"Wasserrettung","9","9","9","90 – Wasserrettung","Ausw90","9","9","00","Kommandant-Stellvertreter (Mz.)","STVKDT 2",8,1,7,"9","9","9. Handsprechfunkgerät des Fahrzeuges","9",null,"MTW   14",null,"Amberg-Sulzbach, Landkreis","AS"]
["sonst. BOS anerk.Rettungsdienste","RD",null,null,"Nürnberger Land, Landkreis","LAU",null,null,"Brandschutz / ABC / CBRN","0","10","10",null,null,"A","A","00","Kreisbrandinspektor Bereich 1","KBI    1",8,4,4,"10","10","1. fest verbautes Funkgerät","",null,"LUFZG 15",null,"Bamberg, Kreisfreie Stadt","BA"]
["sonst. Einh. d. Kat-Schutzes ","SON",null,null,"Roth, Landkreis","RH",null,null,null,null,"11","11",null,null,"B","B","00","Kreisbrandinspektor Bereich 2","KBI    2",8,4,4,"11","11","2. fest verbautes Funkgerät","A",null,"FMKWG 16",null,"Bamberg, Landkreis","BA#"]
["Technisches Hilfswerk","THW",null,null,"Schwabach, Kreisfreie Stadt","SC",null,null,null,null,"12","12",null,null,"C","C","00","Kreisbrandinspektor Bereich 3","KBI    3",8,4,4,"12","12","3. fest verbautes Funkgerät","B",null,"       0",null,"Berchtesgadener Land, Landkreis","BGL"]
["Wasserwacht","WW",null,null,"Weißenburg-Gunzenhausen, Landkreis","WUG",null,null,null,null,"13","13",null,null,"D","D","00","Kreisbrandinspektor Bereich 4","KBI    4",8,4,4,"13","13","4. fest verbautes Funkgerät","C",null,"LTRWR  1",null,"Bayreuth, Kreisfreie Stadt","BT"]
["Werkfeuerwehr","FW",null,null,"Niederbayern","NBY",null,null,null,null,"14","14",null,null,"E","E","00","Kreisbrandinspektor Bereich 5","KBI    5",8,4,4,"14","14","5. fest verbautes Funkgerät","D",null,"LTRTEC 2",null,"Bayreuth, Landkreis","BT#"]
[null,null,null,null,"Deggendorf, Landkreis","DEG",null,null,null,null,"15","15",null,null,"F","F","00","Kreisbrandmeister Bereich 1","KBM    1",8,4,4,"15","15","6. fest verbautes Funkgerät","E",null,"ZFWR   3",null,"Cham, Landkreis","CHA"]
[null,null,null,null,"Dingolfing-Landau, Landkreis","DGF",null,null,null,null,"16","16",null,null,"G","G","00","Kreisbrandmeister Bereich 2","KBM    2",8,4,4,"16","16","7. fest verbautes Funkgerät","F",null,"ZFWR   4",null,"Coburg, Kreisfreie Stadt","CO"]
[null,null,null,null,"Freyung-Grafenau, Landkreis","FRG",null,null,null,null,"17","17",null,null,"H","H","00","Kreisbrandmeister Bereich 3","KBM    3",8,4,4,"17","17","8. fest verbautes Funkgerät","G",null,"LTRWAC 5",null,"Coburg, Landkreis","CO#"]
[null,null,null,null,"Kelheim, Landkreis","KEH",null,null,null,null,"18","18",null,null,"I","I","00","Kreisbrandmeister Bereich 4","KBM    4",8,4,4,"18","18","9. fest verbautes Funkgerät","H",null,"ELWR   7",null,"Dachau, Landkreis","DAH"]
{"$rows_left_out":246}
{"sheet":"Formeln","index":5,"n_rows":48,"n_cols":2,"rows_kept":48,"cut":false,"hidden":true,"merged":[[39,0,44,0],[13,0,16,0],[47,0,51,0]]}
["Datenquelle für I8 - Auswahl Organisation"]
["=Organisation","Bereich \"Organisation\" in Tab.Blatt \"Werte\""]
[]
["Datenquelle für I9 - Vorauswahl für Landkeis"]
["=Bezirk","Bereich \"Bezirk\" in Tab.Blatt \"Werte\""]
[]
["Datenquelle für I10 - Landkeis"]
["=INDIREKT($I$9)","Bereich \"Lkr. pro Bezirk\" in Tab.Blatt \"Werte\""]
[]
["Datenquelle für I11 - Vorauswahl regionale / überörtliche Zuordnung"]
["=Auswahl_Zuordnung","Bereich \"Auswahl_Zuordnung\" in Tab.Blatt \"Werte\""]
[]
["Datenquelle für I12 - Regionale / überörtliche Zuordnung"]
["=WENN($Z$11=\"OeZ\";\n     BEREICH.VERSCHIEBEN('Örtliche Zuordnung'!$A$1;1;VERGLEICH($Z$10;'Örtliche Zuordnung'!$1:$1;0)-1;\n     ANZAHL2(BEREICH.VERSCHIEBEN('Örtliche Zuordnung'!$A:$A;;VERGLEICH($Z$10;'Örtliche Zuordnung'!$1:$1;0)-1))-1);\nINDIREKT($I$9))"]
[null,"Bereich \"Regionale Ortsnamen\" in Tab.Blatt \"OPTA Generator\""]
[null,"Bereich \"Lkr. im Bezirk\" in Tab.Blatt \"Werte\""]
[]
[]
["Datenquelle für I13 - Fachdienstzuweisung"]
["=WENN($Z$11=\"OeZ\";$AA$1;Fachdienst)","Bereich \"Fachdienst\" in Tab.Blatt \"Werte\""]
{"$rows_left_out":29}
{"sheet":"Version","index":6,"n_rows":4,"n_cols":5,"rows_kept":4,"cut":false,"hidden":true,"merged":[]}
[]
[]
[]
[null,"Version","Datum","Bearbeiter","Änderungen"]